Target
fMet-Leu-Phe receptor
Ligand
BDBM37753
Substrate
Meas. Tech.
Dose Response Assay for Formylpeptide Receptor (FPR) Ligands and Dose Response Counter-Screen Assay for Formylpeptide-Like-1 (FPRL1) Ligands
Ki
14900±n/a nM
Citation
 PubChem, PC Dose Response Assay for Formylpeptide Receptor (FPR) Ligands and Dose Response Counter-Screen Assay for Formylpeptide-Like-1 (FPRL1) Ligands PubChem Bioassay (2007)[AID] 
Target
Name:
fMet-Leu-Phe receptor
Synonyms:
FPR FPR1_HUMAN N-formyl peptide receptor 1 fMLP receptor formyl peptide receptor 1
Type:
Enzyme Catalytic Domain
Mol. Mass.:
38456.14
Organism:
Homo sapiens (Human)
Description:
gi_4503779
Residue:
350
  
Inhibitor
Name:
BDBM37753
Synonyms:
MLS000091388 S-[2-[(6-fluoranyl-3-methyl-1,3-benzothiazol-2-ylidene)amino]-2-oxidanylidene-ethyl] ethanethioate SMR000025945 ethanethioic acid S-[2-[(6-fluoro-3-methyl-1,3-benzothiazol-2-ylidene)amino]-2-keto-ethyl] ester | ethanethioic acid S-[2-[(6-fluoro-3-methyl-1,3-benzothiazol-2-ylidene)amino]-2-oxoethyl] ester
Type:
Small organic molecule
Emp. Form.:
C12H11FN2O2S2
Mol. Mass.:
298.356
SMILES:
CC(=O)SCC(=O)N=c1sc2cc(F)ccc2n1C
: