Target
fMet-Leu-Phe receptor
Ligand
BDBM37679
Substrate
Meas. Tech.
Dose Response Assay for Formylpeptide Receptor (FPR) Ligands and Dose Response Counter-Screen Assay for Formylpeptide-Like-1 (FPRL1) Ligands
IC50
>66700±n/a nM
Citation
 PubChem, PC Dose Response Assay for Formylpeptide Receptor (FPR) Ligands and Dose Response Counter-Screen Assay for Formylpeptide-Like-1 (FPRL1) Ligands PubChem Bioassay (2007)[AID] 
Target
Name:
fMet-Leu-Phe receptor
Synonyms:
FPR FPR1_HUMAN N-formyl peptide receptor 1 fMLP receptor formyl peptide receptor 1
Type:
Enzyme Catalytic Domain
Mol. Mass.:
38456.14
Organism:
Homo sapiens (Human)
Description:
gi_4503779
Residue:
350
  
Inhibitor
Name:
BDBM37679
Synonyms:
MLS000057035 N-(3-cyano-1-prop-2-enyl-2-pyrrolo[3,2-b]quinoxalinyl)benzamide N-(3-cyano-1-prop-2-enylpyrrolo[3,2-b]quinoxalin-2-yl)benzamide cid_2309631
Type:
Small organic molecule
Emp. Form.:
C21H15N5O
Mol. Mass.:
353.3767
SMILES:
C=CCn1c(NC(=O)c2ccccc2)c(C#N)c2nc3ccccc3nc12
: