Target
N-formyl peptide receptor 2
Ligand
BDBM34173
Substrate
Meas. Tech.
Dose Response Assay for Formylpeptide Receptor-Like-1 (FPRL1) Ligands and Dose Response Counter-Screen Assay for Formylpeptide Receptor (FPR) Ligands
Ki
>40300±n/a nM
Comments
Extracted from aid = 520 and tid = 2
Citation
 PubChem, PC Dose Response Assay for Formylpeptide Receptor-Like-1 (FPRL1) Ligands and Dose Response Counter-Screen Assay for Formylpeptide Receptor (FPR) Ligands PubChem Bioassay (2007)[AID] 
Target
Name:
N-formyl peptide receptor 2
Synonyms:
ALXR, FPRL1, FPR2 FPR2 FPRH1 Formyl Peptide Receptor-Like 1 LXA4 receptor Lipoxin A4 receptor RFP | hFPRL
Type:
G Protein-Coupled Receptor (GPCR)
Mol. Mass.:
38968.35
Organism:
Homo sapiens (Human)
Description:
P25090
Residue:
351
  
Inhibitor
Name:
BDBM34173
Synonyms:
2-(3-chlorophenyl)-3-(furan-2-carbonyl)-4-hydroxy-1-pyrimidin-2-yl-2H-pyrrol-5-one 2-(3-chlorophenyl)-3-[2-furanyl(oxo)methyl]-4-hydroxy-1-(2-pyrimidinyl)-2H-pyrrol-5-one MLS000037295 cid_660196
Type:
Small organic molecule
Emp. Form.:
C19H12ClN3O4
Mol. Mass.:
381.769
SMILES:
Clc1cccc(c1)C1C(C(=O)c2ccco2)C(=O)C(=O)N1c1ncccn1
: