Target
N-formyl peptide receptor 2
Ligand
BDBM37682
Substrate
Meas. Tech.
Dose Response Assay for Formylpeptide Receptor-Like-1 (FPRL1) Ligands and Dose Response Counter-Screen Assay for Formylpeptide Receptor (FPR) Ligands
Ki
>40300±n/a nM
Comments
Extracted from aid = 520 and tid = 2
Citation
 PubChem, PC Dose Response Assay for Formylpeptide Receptor-Like-1 (FPRL1) Ligands and Dose Response Counter-Screen Assay for Formylpeptide Receptor (FPR) Ligands PubChem Bioassay (2007)[AID] 
Target
Name:
N-formyl peptide receptor 2
Synonyms:
ALXR, FPRL1, FPR2 FPR2 FPRH1 Formyl Peptide Receptor-Like 1 LXA4 receptor Lipoxin A4 receptor RFP | hFPRL
Type:
G Protein-Coupled Receptor (GPCR)
Mol. Mass.:
38968.35
Organism:
Homo sapiens (Human)
Description:
P25090
Residue:
351
  
Inhibitor
Name:
BDBM37682
Synonyms:
MLS000048808 N-[4-methoxy-2-(1-piperidinylsulfonyl)phenyl]carbamic acid ethyl ester cid_2421093 ethyl N-(4-methoxy-2-piperidin-1-ylsulfonylphenyl)carbamate
Type:
Small organic molecule
Emp. Form.:
C15H22N2O5S
Mol. Mass.:
342.411
SMILES:
CCOC(=O)Nc1ccc(OC)cc1S(=O)(=O)N1CCCCC1
: