Target
cAMP-dependent protein kinase catalytic subunit alpha
Ligand
BDBM36864
Substrate
Meas. Tech.
Dose-response biochemical assay for inhibitors of protein kinase A (PKA) activity
IC50
>59640±n/a nM
Citation
 PubChem, PC Dose-response biochemical assay for inhibitors of protein kinase A (PKA) activity PubChem Bioassay (2007)[AID] 
Target
Name:
cAMP-dependent protein kinase catalytic subunit alpha
Synonyms:
KAPCA_HUMAN PKACA cAMP-dependent protein kinase (PKA) cAMP-dependent protein kinase catalytic subunit alpha cAMP-dependent protein kinase catalytic subunit alpha (PKACA) cAMP-dependent protein kinase catalytic subunit alpha isoform 1 | cAMP-dependent protein kinase, alpha-catalytic subunit
Type:
Enzyme Catalytic Subunit
Mol. Mass.:
40598.73
Organism:
Homo sapiens (Human)
Description:
Residue:
351
  
Inhibitor
Name:
BDBM36864
Synonyms:
MLS000074637 N-propyl-N-(5-pyridin-4-yl-1,3,4-thiadiazol-2-yl)thiophene-2-carboxamide SMR000005344 cid_652991
Type:
Small organic molecule
Emp. Form.:
C15H14N4OS2
Mol. Mass.:
330.428
SMILES:
CCCN(C(=O)c1cccs1)c1nnc(s1)-c1ccncc1
: