Target
cAMP-dependent protein kinase catalytic subunit alpha
Ligand
BDBM37879
Substrate
Meas. Tech.
Dose-response biochemical assay for inhibitors of protein kinase A (PKA) activity
IC50
8944±n/a nM
Citation
 PubChem, PC Dose-response biochemical assay for inhibitors of protein kinase A (PKA) activity PubChem Bioassay (2007)[AID] 
Target
Name:
cAMP-dependent protein kinase catalytic subunit alpha
Synonyms:
KAPCA_HUMAN PKACA cAMP-dependent protein kinase (PKA) cAMP-dependent protein kinase catalytic subunit alpha cAMP-dependent protein kinase catalytic subunit alpha (PKACA) cAMP-dependent protein kinase catalytic subunit alpha isoform 1 | cAMP-dependent protein kinase, alpha-catalytic subunit
Type:
Enzyme Catalytic Subunit
Mol. Mass.:
40598.73
Organism:
Homo sapiens (Human)
Description:
Residue:
351
  
Inhibitor
Name:
BDBM37879
Synonyms:
MLS000079197 SMR000035221 cyclohexyl(7H-purin-6-yl)amine
Type:
Small organic molecule
Emp. Form.:
C11H15N5
Mol. Mass.:
217.2703
SMILES:
C1CCC(CC1)Nc1ncnc2nc[nH]c12
: