Target
cAMP-dependent protein kinase catalytic subunit alpha
Ligand
BDBM37883
Substrate
Meas. Tech.
Dose-response biochemical assay for inhibitors of protein kinase A (PKA) activity
IC50
9369±n/a nM
Citation
 PubChem, PC Dose-response biochemical assay for inhibitors of protein kinase A (PKA) activity PubChem Bioassay (2007)[AID] 
Target
Name:
cAMP-dependent protein kinase catalytic subunit alpha
Synonyms:
KAPCA_HUMAN PKACA cAMP-dependent protein kinase (PKA) cAMP-dependent protein kinase catalytic subunit alpha cAMP-dependent protein kinase catalytic subunit alpha (PKACA) cAMP-dependent protein kinase catalytic subunit alpha isoform 1 | cAMP-dependent protein kinase, alpha-catalytic subunit
Type:
Enzyme Catalytic Subunit
Mol. Mass.:
40598.73
Organism:
Homo sapiens (Human)
Description:
Residue:
351
  
Inhibitor
Name:
BDBM37883
Synonyms:
2-(4-pyridyl)-4-pyrrolidino-quinazoline 2-pyridin-4-yl-4-pyrrolidin-1-yl-quinazoline MLS000079648 cid_659763
Type:
Small organic molecule
Emp. Form.:
C17H16N4
Mol. Mass.:
276.3357
SMILES:
C1CCN(C1)c1nc(nc2ccccc12)-c1ccncc1
: