Target
cAMP-dependent protein kinase catalytic subunit alpha
Ligand
BDBM34411
Substrate
Meas. Tech.
Dose-response biochemical assay for inhibitors of protein kinase A (PKA) activity
IC50
11100±n/a nM
Citation
 PubChem, PC Dose-response biochemical assay for inhibitors of protein kinase A (PKA) activity PubChem Bioassay (2007)[AID] 
Target
Name:
cAMP-dependent protein kinase catalytic subunit alpha
Synonyms:
KAPCA_HUMAN PKACA cAMP-dependent protein kinase (PKA) cAMP-dependent protein kinase catalytic subunit alpha cAMP-dependent protein kinase catalytic subunit alpha (PKACA) cAMP-dependent protein kinase catalytic subunit alpha isoform 1 | cAMP-dependent protein kinase, alpha-catalytic subunit
Type:
Enzyme Catalytic Subunit
Mol. Mass.:
40598.73
Organism:
Homo sapiens (Human)
Description:
Residue:
351
  
Inhibitor
Name:
BDBM34411
Synonyms:
1-{[6-(3-pyridinyl)[1,2,4]triazolo[3,4-b][1,3,4]thiadiazol-3-yl]methyl}-1H-benzimidazole 3-(benzimidazol-1-ylmethyl)-6-(3-pyridyl)-[1,2,4]triazolo[3,4-b][1,3,4]thiadiazole MLS000099901 cid_1234059
Type:
Small organic molecule
Emp. Form.:
C16H11N7S
Mol. Mass.:
333.37
SMILES:
C(c1nnc2sc(nn12)-c1cccnc1)n1cnc2ccccc12
: