Target
cAMP-dependent protein kinase catalytic subunit alpha
Ligand
BDBM37917
Substrate
Meas. Tech.
Dose-response biochemical assay for inhibitors of protein kinase A (PKA) activity
IC50
9779±n/a nM
Citation
 PubChem, PC Dose-response biochemical assay for inhibitors of protein kinase A (PKA) activity PubChem Bioassay (2007)[AID] 
Target
Name:
cAMP-dependent protein kinase catalytic subunit alpha
Synonyms:
KAPCA_HUMAN PKACA cAMP-dependent protein kinase (PKA) cAMP-dependent protein kinase catalytic subunit alpha cAMP-dependent protein kinase catalytic subunit alpha (PKACA) cAMP-dependent protein kinase catalytic subunit alpha isoform 1 | cAMP-dependent protein kinase, alpha-catalytic subunit
Type:
Enzyme Catalytic Subunit
Mol. Mass.:
40598.73
Organism:
Homo sapiens (Human)
Description:
Residue:
351
  
Inhibitor
Name:
BDBM37917
Synonyms:
4-(4-methyl-1-piperazinyl)-2-(4-pyridinyl)quinazoline 4-(4-methylpiperazin-1-yl)-2-pyridin-4-yl-quinazoline 4-(4-methylpiperazino)-2-(4-pyridyl)quinazoline SMR000070500 | cid_820817
Type:
Small organic molecule
Emp. Form.:
C18H19N5
Mol. Mass.:
305.377
SMILES:
CN1CCN(CC1)c1nc(nc2ccccc12)-c1ccncc1
: