Target
Diphosphomevalonate decarboxylase
Ligand
BDBM38327
Substrate
Meas. Tech.
Screening for Inhibitors of the Mevalonate Pathway in Streptococcus Pneumoniae - DPM-DC Dose Response
IC50
17111.9±n/a nM
Citation
 PubChem, PC Screening for Inhibitors of the Mevalonate Pathway in Streptococcus Pneumoniae - DPM-DC Dose Response PubChem Bioassay (2007)[AID] 
Target
Name:
Diphosphomevalonate decarboxylase
Synonyms:
Type:
Enzyme Catalytic Domain
Mol. Mass.:
35571.44
Organism:
Streptococcus pneumoniae D39
Description:
A0A0H2ZN59
Residue:
317
  
Inhibitor
Name:
BDBM38327
Synonyms:
2-amino-N-cyclopentyl-1-(3-pyridinylmethylideneamino)-3-pyrrolo[3,2-b]quinoxalinecarboxamide 2-amino-N-cyclopentyl-1-(pyridin-3-ylmethylideneamino)pyrrolo[3,2-b]quinoxaline-3-carboxamide MLS000081435 cid_663385
Type:
Small organic molecule
Emp. Form.:
C22H21N7O
Mol. Mass.:
399.4484
SMILES:
Nc1c(C(=O)NC2CCCC2)c2nc3ccccc3nc2n1N=Cc1cccnc1
: