Target
Diphosphomevalonate decarboxylase
Ligand
BDBM38472
Substrate
Meas. Tech.
Screening for Inhibitors of the Mevalonate Pathway in Streptococcus Pneumoniae - DPM-DC Dose Response
IC50
24435.2±n/a nM
Citation
 PubChem, PC Screening for Inhibitors of the Mevalonate Pathway in Streptococcus Pneumoniae - DPM-DC Dose Response PubChem Bioassay (2007)[AID] 
Target
Name:
Diphosphomevalonate decarboxylase
Synonyms:
Type:
Enzyme Catalytic Domain
Mol. Mass.:
35571.44
Organism:
Streptococcus pneumoniae D39
Description:
A0A0H2ZN59
Residue:
317
  
Inhibitor
Name:
BDBM38472
Synonyms:
(3aS,4S,9bS)-8-chloranyl-4-(furan-2-yl)-2,3,3a,4,5,9b-hexahydrofuro[3,2-c]quinoline (3aS,4S,9bS)-8-chloro-4-(2-furyl)-2,3,3a,4,5,9b-hexahydrofuro[3,2-c]quinoline MLS000115005 cid_1085710
Type:
Small organic molecule
Emp. Form.:
C15H14ClNO2
Mol. Mass.:
275.73
SMILES:
Clc1ccc2N[C@@H]([C@@H]3CCO[C@@H]3c2c1)c1ccco1
: