Target
Dual specificity protein phosphatase 6
Ligand
BDBM35371
Substrate
Meas. Tech.
In vitro MKP-3 Phosphatase Dose Response Hit/Probe Assessment Assay
IC50
8044±n/a nM
Citation
 PubChem, PC In vitro MKP-3 Phosphatase Dose Response Hit/Probe Assessment Assay PubChem Bioassay (2007)[AID] 
Target
Name:
Dual specificity protein phosphatase 6
Synonyms:
DUS6_RAT MAP kinase phosphatase 3 Mitogen-activated protein kinase phosphatase 3 | Mkp3
Type:
Enzyme
Mol. Mass.:
42303.19
Organism:
Rattus norvegicus
Description:
gi_16758752
Residue:
381
  
Inhibitor
Name:
BDBM35371
Synonyms:
(7-chloro-5-pyrrolidino-benzofurazan-4-yl)amine 7-chloro-5-(1-pyrrolidinyl)-2,1,3-benzoxadiazol-4-amine MLS000042514 cid_667215
Type:
Small organic molecule
Emp. Form.:
C10H11ClN4O
Mol. Mass.:
238.674
SMILES:
Nc1c(cc(Cl)c2nonc12)N1CCCC1
: