Target
Dual specificity protein phosphatase 6
Ligand
BDBM35372
Substrate
Meas. Tech.
In vitro MKP-3 Phosphatase Dose Response Hit/Probe Assessment Assay
IC50
>50000±n/a nM
Citation
 PubChem, PC In vitro MKP-3 Phosphatase Dose Response Hit/Probe Assessment Assay PubChem Bioassay (2007)[AID] 
Target
Name:
Dual specificity protein phosphatase 6
Synonyms:
DUS6_RAT MAP kinase phosphatase 3 Mitogen-activated protein kinase phosphatase 3 | Mkp3
Type:
Enzyme
Mol. Mass.:
42303.19
Organism:
Rattus norvegicus
Description:
gi_16758752
Residue:
381
  
Inhibitor
Name:
BDBM35372
Synonyms:
1-[4-(4-chlorophenyl)sulfonyl-1-piperazinyl]-2-[(5,7-dimethyl-[1,2,4]triazolo[4,3-a]pyrimidin-3-yl)thio]ethanone 1-[4-(4-chlorophenyl)sulfonylpiperazino]-2-[(5,7-dimethyl-[1,2,4]triazolo[4,3-a]pyrimidin-3-yl)thio]ethanone SMR000067536 | cid_2090539
Type:
Small organic molecule
Emp. Form.:
C19H21ClN6O3S2
Mol. Mass.:
480.991
SMILES:
Cc1cc(C)n2c(SCC(=O)N3CCN(CC3)S(=O)(=O)c3ccc(Cl)cc3)nnc2n1
: