Target
Dual specificity protein phosphatase 6
Ligand
BDBM33055
Substrate
Meas. Tech.
In vitro MKP-3 Phosphatase Dose Response Hit/Probe Assessment Assay
IC50
>50000±n/a nM
Citation
 PubChem, PC In vitro MKP-3 Phosphatase Dose Response Hit/Probe Assessment Assay PubChem Bioassay (2007)[AID] 
Target
Name:
Dual specificity protein phosphatase 6
Synonyms:
DUS6_RAT MAP kinase phosphatase 3 Mitogen-activated protein kinase phosphatase 3 | Mkp3
Type:
Enzyme
Mol. Mass.:
42303.19
Organism:
Rattus norvegicus
Description:
gi_16758752
Residue:
381
  
Inhibitor
Name:
BDBM33055
Synonyms:
2,3-bis(2-furanyl)-N-phenyl-6-quinoxalinecarboxamide 2,3-bis(furan-2-yl)-N-phenyl-quinoxaline-6-carboxamide 2,3-di-2-furyl-N-phenyl-6-quinoxalinecarboxamide SMR000077343 | cid_2213073
Type:
Small organic molecule
Emp. Form.:
C23H15N3O3
Mol. Mass.:
381.3835
SMILES:
O=C(Nc1ccccc1)c1ccc2nc(-c3ccco3)c(nc2c1)-c1ccco1
: