Target
Mevalonate kinase
Ligand
BDBM34334
Substrate
Meas. Tech.
Screening for Inhibitors of the Mevalonate Pathway in Streptococcus Pneumoniae - MK Dose Response
IC50
9687.8±n/a nM
Citation
 PubChem, PC Screening for Inhibitors of the Mevalonate Pathway in Streptococcus Pneumoniae - MK Dose Response PubChem Bioassay (2007)[AID] 
Target
Name:
Mevalonate kinase
Synonyms:
Type:
Enzyme Catalytic Domain
Mol. Mass.:
31420.64
Organism:
Streptococcus pneumoniae D39
Description:
A0A0H2ZQX9
Residue:
292
  
Inhibitor
Name:
BDBM34334
Synonyms:
MLS000055225 N-[1,3-benzothiazol-2-yl(phenyl)phosphoryl]-2-thiazolamine [1,3-benzothiazol-2-yl(phenyl)phosphoryl]-thiazol-2-yl-amine | cid_2311082
Type:
Small organic molecule
Emp. Form.:
C16H12N3OPS2
Mol. Mass.:
357.39
SMILES:
O=P(Nc1nccs1)(c1nc2ccccc2s1)c1ccccc1
: