Target
Mevalonate kinase
Ligand
BDBM29632
Substrate
Meas. Tech.
Screening for Inhibitors of the Mevalonate Pathway in Streptococcus Pneumoniae - MK Dose Response
IC50
1099.4±n/a nM
Citation
 PubChem, PC Screening for Inhibitors of the Mevalonate Pathway in Streptococcus Pneumoniae - MK Dose Response PubChem Bioassay (2007)[AID] 
Target
Name:
Mevalonate kinase
Synonyms:
Type:
Enzyme Catalytic Domain
Mol. Mass.:
31420.64
Organism:
Streptococcus pneumoniae D39
Description:
A0A0H2ZQX9
Residue:
292
  
Inhibitor
Name:
BDBM29632
Synonyms:
2-[2-(3-keto-1,2-benzothiazol-2-yl)thiazol-4-yl]acetic acid ethyl ester MLS000082162 cid_2328662 ethyl 2-[2-(3-oxo-1,2-benzothiazol-2-yl)-1,3-thiazol-4-yl]acetate
Type:
Small organic molecule
Emp. Form.:
C14H12N2O3S2
Mol. Mass.:
320.387
SMILES:
CCOC(=O)Cc1csc(n1)-n1sc2ccccc2c1=O
: