Target
Dual specificity protein phosphatase 1
Ligand
BDBM31752
Substrate
Meas. Tech.
In vitro MKP-1 Phosphatase Dose Response Active/Probe Assessment Assay - Effects of DTT
IC50
13110±n/a nM
Citation
 PubChem, PC In vitro MKP-1 Phosphatase Dose Response Active/Probe Assessment Assay - Effects of DTT PubChem Bioassay (2006)[AID] 
Target
Name:
Dual specificity protein phosphatase 1
Synonyms:
CL100 DUSP1 MAP kinase phosphatase 1 MKP1 Protein-tyrosine phosphatase CL100 | VH1
Type:
Protein phosphatase
Mol. Mass.:
39301.48
Organism:
Homo sapiens (Human)
Description:
gi_4758204
Residue:
367
  
Inhibitor
Name:
BDBM31752
Synonyms:
Icosa‐5,8,11,14‐tetraynoic acid (D3) cid_1780 | eicosa-5,8,11,14-tetraynoic acid
Type:
Small organic molecule
Emp. Form.:
C20H24O2
Mol. Mass.:
296.4034
SMILES:
CCCCCC#CCC#CCC#CCC#CCCCC(O)=O
: