Target
Dual specificity protein phosphatase 1
Ligand
BDBM35361
Substrate
Meas. Tech.
In vitro MKP-1 Phosphatase Dose Response Active/Probe Assessment Assay - Effects of DTT
IC50
6960±n/a nM
Citation
 PubChem, PC In vitro MKP-1 Phosphatase Dose Response Active/Probe Assessment Assay - Effects of DTT PubChem Bioassay (2006)[AID] 
Target
Name:
Dual specificity protein phosphatase 1
Synonyms:
CL100 DUSP1 MAP kinase phosphatase 1 MKP1 Protein-tyrosine phosphatase CL100 | VH1
Type:
Protein phosphatase
Mol. Mass.:
39301.48
Organism:
Homo sapiens (Human)
Description:
gi_4758204
Residue:
367
  
Inhibitor
Name:
BDBM35361
Synonyms:
(5-oxidanidyl-4-thiophen-2-ylcarbonyl-1,2,5-oxadiazol-5-ium-3-yl)-thiophen-2-yl-methanone SMR000034137 [5-oxido-4-(thiophene-2-carbonyl)-1,2,5-oxadiazol-5-ium-3-yl]-thiophen-2-ylmethanone cid_573747
Type:
Small organic molecule
Emp. Form.:
C12H6N2O4S2
Mol. Mass.:
306.317
SMILES:
[O-]n1[o+]nc(C(=O)c2cccs2)c1C(=O)c1cccs1
: