Target
Dual specificity protein phosphatase 1
Ligand
BDBM30725
Substrate
Meas. Tech.
In vitro MKP-1 Phosphatase Dose Response Active/Probe Assessment Assay - Effects of DTT
IC50
>50000±n/a nM
Citation
 PubChem, PC In vitro MKP-1 Phosphatase Dose Response Active/Probe Assessment Assay - Effects of DTT PubChem Bioassay (2006)[AID] 
Target
Name:
Dual specificity protein phosphatase 1
Synonyms:
CL100 DUSP1 MAP kinase phosphatase 1 MKP1 Protein-tyrosine phosphatase CL100 | VH1
Type:
Protein phosphatase
Mol. Mass.:
39301.48
Organism:
Homo sapiens (Human)
Description:
gi_4758204
Residue:
367
  
Inhibitor
Name:
BDBM30725
Synonyms:
MLS000079925 N-[3-cyano-1-(4-methoxyphenyl)pyrrolo[3,2-b]quinoxalin-2-yl]-2-furamide SMR000039887 | cid_658939
Type:
Small organic molecule
Emp. Form.:
C23H15N5O3
Mol. Mass.:
409.3969
SMILES:
COc1ccc(cc1)-n1c(NC(=O)c2ccco2)c(C#N)c2nc3ccccc3nc12
: