Target
Dual specificity protein phosphatase 1
Ligand
BDBM34287
Substrate
Meas. Tech.
In vitro MKP-1 Phosphatase Dose Response Active/Probe Assessment Assay - Effects of DTT
IC50
22737±n/a nM
Citation
 PubChem, PC In vitro MKP-1 Phosphatase Dose Response Active/Probe Assessment Assay - Effects of DTT PubChem Bioassay (2006)[AID] 
Target
Name:
Dual specificity protein phosphatase 1
Synonyms:
CL100 DUSP1 MAP kinase phosphatase 1 MKP1 Protein-tyrosine phosphatase CL100 | VH1
Type:
Protein phosphatase
Mol. Mass.:
39301.48
Organism:
Homo sapiens (Human)
Description:
gi_4758204
Residue:
367
  
Inhibitor
Name:
BDBM34287
Synonyms:
MLS000082957 cid_665737
Type:
Small organic molecule
Emp. Form.:
C21H23N5O2S3
Mol. Mass.:
473.635
SMILES:
CC(C)Sc1nc2sc3CCCCc3c2c2nnc(SCC(=O)NCc3ccco3)n12
: