Target
Dual specificity protein phosphatase 1
Ligand
BDBM32085
Substrate
Meas. Tech.
In vitro MKP-1 Phosphatase Dose Response Active/Probe Assessment Assay - Effects of DTT
IC50
>50000±n/a nM
Citation
 PubChem, PC In vitro MKP-1 Phosphatase Dose Response Active/Probe Assessment Assay - Effects of DTT PubChem Bioassay (2006)[AID] 
Target
Name:
Dual specificity protein phosphatase 1
Synonyms:
CL100 DUSP1 MAP kinase phosphatase 1 MKP1 Protein-tyrosine phosphatase CL100 | VH1
Type:
Protein phosphatase
Mol. Mass.:
39301.48
Organism:
Homo sapiens (Human)
Description:
gi_4758204
Residue:
367
  
Inhibitor
Name:
BDBM32085
Synonyms:
MLS000085603 N-(2-hydroxy-1,3-dioxo-2,3-dihydro-1H-inden-2-yl)benzamide N-(2-hydroxy-1,3-dioxoinden-2-yl)benzamide SMR000020538 | cid_3237318
Type:
Small organic molecule
Emp. Form.:
C16H11NO4
Mol. Mass.:
281.2628
SMILES:
OC1(NC(=O)c2ccccc2)C(=O)c2ccccc2C1=O
: