Target
Dual specificity protein phosphatase 1
Ligand
BDBM35394
Substrate
Meas. Tech.
In vitro MKP-1 Phosphatase Dose Response Active/Probe Assessment Assay - Effects of DTT
IC50
49909±n/a nM
Citation
 PubChem, PC In vitro MKP-1 Phosphatase Dose Response Active/Probe Assessment Assay - Effects of DTT PubChem Bioassay (2006)[AID] 
Target
Name:
Dual specificity protein phosphatase 1
Synonyms:
CL100 DUSP1 MAP kinase phosphatase 1 MKP1 Protein-tyrosine phosphatase CL100 | VH1
Type:
Protein phosphatase
Mol. Mass.:
39301.48
Organism:
Homo sapiens (Human)
Description:
gi_4758204
Residue:
367
  
Inhibitor
Name:
BDBM35394
Synonyms:
6-chloranyl-N-[2-(cyclohexen-1-yl)ethyl]-5-methyl-7-oxidanylidene-1H-pyrazolo[1,5-a]pyrimidine-3-carboxamide 6-chloro-N-[2-(1-cyclohexenyl)ethyl]-5-methyl-7-oxo-1H-pyrazolo[1,5-a]pyrimidine-3-carboxamide 6-chloro-N-[2-(cyclohexen-1-yl)ethyl]-7-keto-5-methyl-1H-pyrazolo[1,5-a]pyrimidine-3-carboxamide SMR000031679 | cid_3240744
Type:
Small organic molecule
Emp. Form.:
C16H19ClN4O2
Mol. Mass.:
334.801
SMILES:
Cc1nc2c(c[nH]n2c(=O)c1Cl)C(=O)NCCC1=CCCCC1
: