Target
Dual specificity protein phosphatase 1
Ligand
BDBM35400
Substrate
Meas. Tech.
In vitro MKP-1 Phosphatase Dose Response Active/Probe Assessment Assay - Effects of DTT
IC50
25731±n/a nM
Citation
 PubChem, PC In vitro MKP-1 Phosphatase Dose Response Active/Probe Assessment Assay - Effects of DTT PubChem Bioassay (2006)[AID] 
Target
Name:
Dual specificity protein phosphatase 1
Synonyms:
CL100 DUSP1 MAP kinase phosphatase 1 MKP1 Protein-tyrosine phosphatase CL100 | VH1
Type:
Protein phosphatase
Mol. Mass.:
39301.48
Organism:
Homo sapiens (Human)
Description:
gi_4758204
Residue:
367
  
Inhibitor
Name:
BDBM35400
Synonyms:
3-amino-N-(5-propylsulfanyl-1,3,4-thiadiazol-2-yl)-6-thiophen-2-ylthieno[2,3-b]pyridine-2-carboxamide 3-amino-N-[5-(propylthio)-1,3,4-thiadiazol-2-yl]-6-thien-2-ylthieno[2,3-b]pyridine-2-carboxamide 3-azanyl-N-(5-propylsulfanyl-1,3,4-thiadiazol-2-yl)-6-thiophen-2-yl-thieno[2,3-b]pyridine-2-carboxamide SMR000019719 | cid_1773030
Type:
Small organic molecule
Emp. Form.:
C17H15N5OS4
Mol. Mass.:
433.594
SMILES:
CCCSc1nnc(NC(=O)c2sc3nc(ccc3c2N)-c2cccs2)s1
: