Target
Dual specificity protein phosphatase 1
Ligand
BDBM32102
Substrate
Meas. Tech.
In vitro MKP-1 Phosphatase Dose Response Active/Probe Assessment Assay - Effects of DTT
IC50
>50000±n/a nM
Citation
 PubChem, PC In vitro MKP-1 Phosphatase Dose Response Active/Probe Assessment Assay - Effects of DTT PubChem Bioassay (2006)[AID] 
Target
Name:
Dual specificity protein phosphatase 1
Synonyms:
CL100 DUSP1 MAP kinase phosphatase 1 MKP1 Protein-tyrosine phosphatase CL100 | VH1
Type:
Protein phosphatase
Mol. Mass.:
39301.48
Organism:
Homo sapiens (Human)
Description:
gi_4758204
Residue:
367
  
Inhibitor
Name:
BDBM32102
Synonyms:
1,6-dimethylpyrimido[5,4-e][1,2,4]triazine-5,7(1H,6H)-dione 1,6-dimethylpyrimido[5,4-e][1,2,4]triazine-5,7-quinone SMR000024051 US9738628, Compound PKF118-310 | cid_66541
Type:
Small organic molecule
Emp. Form.:
C7H7N5O2
Mol. Mass.:
193.1628
SMILES:
Cn1ncnc2c1nc(=O)n(C)c2=O
: