Target
Dual specificity protein phosphatase 1
Ligand
BDBM35414
Substrate
Meas. Tech.
In vitro MKP-1 Phosphatase Dose Response Active/Probe Assessment Assay - Effects of DTT
IC50
36690±n/a nM
Citation
 PubChem, PC In vitro MKP-1 Phosphatase Dose Response Active/Probe Assessment Assay - Effects of DTT PubChem Bioassay (2006)[AID] 
Target
Name:
Dual specificity protein phosphatase 1
Synonyms:
CL100 DUSP1 MAP kinase phosphatase 1 MKP1 Protein-tyrosine phosphatase CL100 | VH1
Type:
Protein phosphatase
Mol. Mass.:
39301.48
Organism:
Homo sapiens (Human)
Description:
gi_4758204
Residue:
367
  
Inhibitor
Name:
BDBM35414
Synonyms:
5-oxidanylidene-N3-(oxolan-2-ylmethyl)-N8-pentyl-1-sulfanylidene-4H-[1,3]thiazolo[3,4-a]quinazoline-3,8-dicarboxamide 5-oxo-N3-(2-oxolanylmethyl)-N8-pentyl-1-sulfanylidene-4H-thiazolo[3,4-a]quinazoline-3,8-dicarboxamide MLS000094742 SMR000030295 | cid_3245487
Type:
Small organic molecule
Emp. Form.:
C22H26N4O4S2
Mol. Mass.:
474.596
SMILES:
CCCCCNC(=O)c1ccc2c(c1)n1c([nH]c2=O)c(sc1=S)C(=O)NCC1CCCO1
: