Target
Dual specificity protein phosphatase 1
Ligand
BDBM35368
Substrate
Meas. Tech.
In vitro MKP-1 Phosphatase Dose Response Active/Probe Assessment Assay - Effects of Catalase
IC50
>50000±n/a nM
Citation
 PubChem, PC In vitro MKP-1 Phosphatase Dose Response Active/Probe Assessment Assay - Effects of Catalase PubChem Bioassay (2006)[AID] 
Target
Name:
Dual specificity protein phosphatase 1
Synonyms:
CL100 DUSP1 MAP kinase phosphatase 1 MKP1 Protein-tyrosine phosphatase CL100 | VH1
Type:
Protein phosphatase
Mol. Mass.:
39301.48
Organism:
Homo sapiens (Human)
Description:
gi_4758204
Residue:
367
  
Inhibitor
Name:
BDBM35368
Synonyms:
2-amino-N-butyl-1-(3-methoxypropyl)-3-pyrrolo[3,2-b]quinoxalinecarboxamide 2-azanyl-N-butyl-1-(3-methoxypropyl)pyrrolo[3,2-b]quinoxaline-3-carboxamide SMR000043612 | cid_662864
Type:
Small organic molecule
Emp. Form.:
C19H25N5O2
Mol. Mass.:
355.4341
SMILES:
CCCCNC(=O)c1c(N)n(CCCOC)c2nc3ccccc3nc12
: