Target
Dual specificity protein phosphatase 1
Ligand
BDBM32062
Substrate
Meas. Tech.
In vitro MKP-1 Phosphatase Dose Response Active/Probe Assessment Assay - Effects of Catalase
IC50
32374±n/a nM
Citation
 PubChem, PC In vitro MKP-1 Phosphatase Dose Response Active/Probe Assessment Assay - Effects of Catalase PubChem Bioassay (2006)[AID] 
Target
Name:
Dual specificity protein phosphatase 1
Synonyms:
CL100 DUSP1 MAP kinase phosphatase 1 MKP1 Protein-tyrosine phosphatase CL100 | VH1
Type:
Protein phosphatase
Mol. Mass.:
39301.48
Organism:
Homo sapiens (Human)
Description:
gi_4758204
Residue:
367
  
Inhibitor
Name:
BDBM32062
Synonyms:
MLS000054842 N-(1-butyl-3-cyano-pyrrolo[3,2-b]quinoxalin-2-yl)benzamide SMR000060333 US9073941, 1003 | cid_1910302
Type:
Small organic molecule
Emp. Form.:
C22H19N5O
Mol. Mass.:
369.4192
SMILES:
CCCCn1c(NC(=O)c2ccccc2)c(C#N)c2nc3ccccc3nc12
: