Target
Dual specificity protein phosphatase 1
Ligand
BDBM35380
Substrate
Meas. Tech.
In vitro MKP-1 Phosphatase Dose Response Active/Probe Assessment Assay - Effects of Catalase
IC50
46635±n/a nM
Citation
 PubChem, PC In vitro MKP-1 Phosphatase Dose Response Active/Probe Assessment Assay - Effects of Catalase PubChem Bioassay (2006)[AID] 
Target
Name:
Dual specificity protein phosphatase 1
Synonyms:
CL100 DUSP1 MAP kinase phosphatase 1 MKP1 Protein-tyrosine phosphatase CL100 | VH1
Type:
Protein phosphatase
Mol. Mass.:
39301.48
Organism:
Homo sapiens (Human)
Description:
gi_4758204
Residue:
367
  
Inhibitor
Name:
BDBM35380
Synonyms:
MLS000096457 N-phenyl-1-pyridin-4-yl-methanimine oxide SMR000062185 | cid_768563
Type:
Small organic molecule
Emp. Form.:
C12H10N2O
Mol. Mass.:
198.2206
SMILES:
[O-]\[N+](=C/c1ccncc1)c1ccccc1
: