Target
Dual specificity protein phosphatase 1
Ligand
BDBM35372
Substrate
Meas. Tech.
In vitro MKP-1 Phosphatase Dose Response Active/Probe Assessment Assay - Reproducibility testing
IC50
48818±n/a nM
Citation
 PubChem, PC In vitro MKP-1 Phosphatase Dose Response Active/Probe Assessment Assay - Reproducibility testing PubChem Bioassay (2006)[AID] 
Target
Name:
Dual specificity protein phosphatase 1
Synonyms:
CL100 DUSP1 MAP kinase phosphatase 1 MKP1 Protein-tyrosine phosphatase CL100 | VH1
Type:
Protein phosphatase
Mol. Mass.:
39301.48
Organism:
Homo sapiens (Human)
Description:
gi_4758204
Residue:
367
  
Inhibitor
Name:
BDBM35372
Synonyms:
1-[4-(4-chlorophenyl)sulfonyl-1-piperazinyl]-2-[(5,7-dimethyl-[1,2,4]triazolo[4,3-a]pyrimidin-3-yl)thio]ethanone 1-[4-(4-chlorophenyl)sulfonylpiperazino]-2-[(5,7-dimethyl-[1,2,4]triazolo[4,3-a]pyrimidin-3-yl)thio]ethanone SMR000067536 | cid_2090539
Type:
Small organic molecule
Emp. Form.:
C19H21ClN6O3S2
Mol. Mass.:
480.991
SMILES:
Cc1cc(C)n2c(SCC(=O)N3CCN(CC3)S(=O)(=O)c3ccc(Cl)cc3)nnc2n1
: