Target
Dual specificity protein phosphatase 1
Ligand
BDBM35379
Substrate
Meas. Tech.
In vitro MKP-1 Phosphatase Dose Response Active/Probe Assessment Assay - Reproducibility testing
IC50
24244±n/a nM
Citation
 PubChem, PC In vitro MKP-1 Phosphatase Dose Response Active/Probe Assessment Assay - Reproducibility testing PubChem Bioassay (2006)[AID] 
Target
Name:
Dual specificity protein phosphatase 1
Synonyms:
CL100 DUSP1 MAP kinase phosphatase 1 MKP1 Protein-tyrosine phosphatase CL100 | VH1
Type:
Protein phosphatase
Mol. Mass.:
39301.48
Organism:
Homo sapiens (Human)
Description:
gi_4758204
Residue:
367
  
Inhibitor
Name:
BDBM35379
Synonyms:
2-(2-furanyl)-4-quinolinecarboxylic acid [2-[4-amino-1-methyl-3-(2-methylpropyl)-2,6-dioxo-5-pyrimidinyl]-2-oxoethyl] ester MLS000058168 [2-[4-amino-1-methyl-3-(2-methylpropyl)-2,6-dioxopyrimidin-5-yl]-2-oxoethyl] 2-(furan-2-yl)quinoline-4-carboxylate cid_2094474
Type:
Small organic molecule
Emp. Form.:
C25H24N4O6
Mol. Mass.:
476.4813
SMILES:
CC(C)Cn1c(N)c(C(=O)COC(=O)c2cc(nc3ccccc23)-c2ccco2)c(=O)n(C)c1=O
: