Target
Dual specificity protein phosphatase 1
Ligand
BDBM32096
Substrate
Meas. Tech.
In vitro MKP-1 Phosphatase Dose Response Active/Probe Assessment Assay - Reproducibility testing
IC50
>50000±n/a nM
Citation
 PubChem, PC In vitro MKP-1 Phosphatase Dose Response Active/Probe Assessment Assay - Reproducibility testing PubChem Bioassay (2006)[AID] 
Target
Name:
Dual specificity protein phosphatase 1
Synonyms:
CL100 DUSP1 MAP kinase phosphatase 1 MKP1 Protein-tyrosine phosphatase CL100 | VH1
Type:
Protein phosphatase
Mol. Mass.:
39301.48
Organism:
Homo sapiens (Human)
Description:
gi_4758204
Residue:
367
  
Inhibitor
Name:
BDBM32096
Synonyms:
(6-phenyl-4,5-dihydropyrazolo[4,3-e][1,3]benzothiazol-2-yl)amine 6-phenyl-5,6-dihydro-4H-[1,3]thiazolo[4,5-e]indazol-2-amine SMR000021277 | cid_712700
Type:
Small organic molecule
Emp. Form.:
C14H12N4S
Mol. Mass.:
268.337
SMILES:
Nc1nc-2c(CCc3c-2cnn3-c2ccccc2)s1
: