Target
Dual specificity protein phosphatase 1
Ligand
BDBM35419
Substrate
Meas. Tech.
In vitro MKP-1 Phosphatase Dose Response Active/Probe Assessment Assay - Reproducibility testing
IC50
20274±n/a nM
Citation
 PubChem, PC In vitro MKP-1 Phosphatase Dose Response Active/Probe Assessment Assay - Reproducibility testing PubChem Bioassay (2006)[AID] 
Target
Name:
Dual specificity protein phosphatase 1
Synonyms:
CL100 DUSP1 MAP kinase phosphatase 1 MKP1 Protein-tyrosine phosphatase CL100 | VH1
Type:
Protein phosphatase
Mol. Mass.:
39301.48
Organism:
Homo sapiens (Human)
Description:
gi_4758204
Residue:
367
  
Inhibitor
Name:
BDBM35419
Synonyms:
MLS000050867 N-(9-ethyl-9H-carbazol-3-yl)-2-{[4-ethyl-5-(2-furyl)-4H-1,2,4-triazol-3-yl]thio}acetamide N-(9-ethylcarbazol-3-yl)-2-[[4-ethyl-5-(furan-2-yl)-1,2,4-triazol-3-yl]sulfanyl]acetamide SMR000078562 | cid_1890961
Type:
Small organic molecule
Emp. Form.:
C24H23N5O2S
Mol. Mass.:
445.537
SMILES:
CCn1c(SCC(=O)Nc2ccc3n(CC)c4ccccc4c3c2)nnc1-c1ccco1
: