Target
Dual specificity protein phosphatase 1
Ligand
BDBM31734
Substrate
Meas. Tech.
In vitro MKP-1 Phosphatase Dose Response Active/Probe Assessment Assay - Reproducibility testing
IC50
32798±n/a nM
Citation
 PubChem, PC In vitro MKP-1 Phosphatase Dose Response Active/Probe Assessment Assay - Reproducibility testing PubChem Bioassay (2006)[AID] 
Target
Name:
Dual specificity protein phosphatase 1
Synonyms:
CL100 DUSP1 MAP kinase phosphatase 1 MKP1 Protein-tyrosine phosphatase CL100 | VH1
Type:
Protein phosphatase
Mol. Mass.:
39301.48
Organism:
Homo sapiens (Human)
Description:
gi_4758204
Residue:
367
  
Inhibitor
Name:
BDBM31734
Synonyms:
8-carbethoxy-3a,4,5,9b-tetrahydro-3H-cyclopenta[c]quinoline-4-carboxylic acid MLS-0025126.0001 cid_2859888
Type:
Small organic molecule
Emp. Form.:
C16H17NO4
Mol. Mass.:
287.3105
SMILES:
CCOC(=O)c1ccc2NC(C3CC=CC3c2c1)C(O)=O
: