Target
Dual specificity protein phosphatase 6
Ligand
BDBM35395
Substrate
Meas. Tech.
In vitro MKP-3 Phosphatase Dose Response Active/Probe Assessment Assay - Effects of Catalase
IC50
>50000±n/a nM
Citation
 PubChem, PC In vitro MKP-3 Phosphatase Dose Response Active/Probe Assessment Assay - Effects of Catalase PubChem Bioassay (2006)[AID] 
Target
Name:
Dual specificity protein phosphatase 6
Synonyms:
DUS6_RAT MAP kinase phosphatase 3 Mitogen-activated protein kinase phosphatase 3 | Mkp3
Type:
Enzyme
Mol. Mass.:
42303.19
Organism:
Rattus norvegicus
Description:
gi_16758752
Residue:
381
  
Inhibitor
Name:
BDBM35395
Synonyms:
2-(4-methoxyphenyl)-5-[1-[(2-methylpropan-2-yl)oxy-oxomethyl]-4-piperidinyl]-6-pyrazolo[1,5-a]pyrimidinecarboxylic acid 5-(1-tert-butoxycarbonyl-4-piperidyl)-2-(4-methoxyphenyl)pyrazolo[1,5-a]pyrimidine-6-carboxylic acid MLS000045832 cid_3240935
Type:
Small organic molecule
Emp. Form.:
C24H28N4O5
Mol. Mass.:
452.5029
SMILES:
COc1ccc(cc1)-c1cc2nc(C3CCN(CC3)C(=O)OC(C)(C)C)c(cn2n1)C(O)=O
: