Target
Dual specificity protein phosphatase 6
Ligand
BDBM33046
Substrate
Meas. Tech.
In vitro MKP-3 Phosphatase Dose Response Active/Probe Assessment Assay - Reproducibility testing
IC50
>50000±n/a nM
Citation
 PubChem, PC In vitro MKP-3 Phosphatase Dose Response Active/Probe Assessment Assay - Reproducibility testing PubChem Bioassay (2007)[AID] 
Target
Name:
Dual specificity protein phosphatase 6
Synonyms:
DUS6_RAT MAP kinase phosphatase 3 Mitogen-activated protein kinase phosphatase 3 | Mkp3
Type:
Enzyme
Mol. Mass.:
42303.19
Organism:
Rattus norvegicus
Description:
gi_16758752
Residue:
381
  
Inhibitor
Name:
BDBM33046
Synonyms:
2-[(5-amino-1H-1,2,4-triazol-3-yl)sulfanyl]-N-[3-cyano-7,7-dimethyl-5-[(E)-2-(5-methylfuran-2-yl)ethenyl]-6H-1-benzothiophen-2-yl]acetamide 2-[(5-amino-1H-1,2,4-triazol-3-yl)thio]-N-[3-cyano-7,7-dimethyl-5-[(E)-2-(5-methyl-2-furyl)vinyl]-6H-benzothiophen-2-yl]acetamide MLS000097571 cid_2079240
Type:
Small organic molecule
Emp. Form.:
C22H22N6O2S2
Mol. Mass.:
466.579
SMILES:
Cc1ccc(\C=C\C2=Cc3c(sc(NC(=O)CSc4nnc(N)[nH]4)c3C#N)C(C)(C)C2)o1
: