Target
Dual specificity protein phosphatase 6
Ligand
BDBM35414
Substrate
Meas. Tech.
In vitro MKP-3 Phosphatase Dose Response Active/Probe Assessment Assay - Reproducibility testing
IC50
>50000±n/a nM
Citation
 PubChem, PC In vitro MKP-3 Phosphatase Dose Response Active/Probe Assessment Assay - Reproducibility testing PubChem Bioassay (2007)[AID] 
Target
Name:
Dual specificity protein phosphatase 6
Synonyms:
DUS6_RAT MAP kinase phosphatase 3 Mitogen-activated protein kinase phosphatase 3 | Mkp3
Type:
Enzyme
Mol. Mass.:
42303.19
Organism:
Rattus norvegicus
Description:
gi_16758752
Residue:
381
  
Inhibitor
Name:
BDBM35414
Synonyms:
5-oxidanylidene-N3-(oxolan-2-ylmethyl)-N8-pentyl-1-sulfanylidene-4H-[1,3]thiazolo[3,4-a]quinazoline-3,8-dicarboxamide 5-oxo-N3-(2-oxolanylmethyl)-N8-pentyl-1-sulfanylidene-4H-thiazolo[3,4-a]quinazoline-3,8-dicarboxamide MLS000094742 SMR000030295 | cid_3245487
Type:
Small organic molecule
Emp. Form.:
C22H26N4O4S2
Mol. Mass.:
474.596
SMILES:
CCCCCNC(=O)c1ccc2c(c1)n1c([nH]c2=O)c(sc1=S)C(=O)NCC1CCCO1
: