Target
Dual specificity protein phosphatase 6
Ligand
BDBM31704
Substrate
Meas. Tech.
In vitro MKP-3 Phosphatase Dose Response Active/Probe Assessment Assay - Reproducibility testing
IC50
>50000±n/a nM
Citation
 PubChem, PC In vitro MKP-3 Phosphatase Dose Response Active/Probe Assessment Assay - Reproducibility testing PubChem Bioassay (2007)[AID] 
Target
Name:
Dual specificity protein phosphatase 6
Synonyms:
DUS6_RAT MAP kinase phosphatase 3 Mitogen-activated protein kinase phosphatase 3 | Mkp3
Type:
Enzyme
Mol. Mass.:
42303.19
Organism:
Rattus norvegicus
Description:
gi_16758752
Residue:
381
  
Inhibitor
Name:
BDBM31704
Synonyms:
MLS000050353 N-[2,3-bis(2-furanyl)-6-quinoxalinyl]-1-azepanecarboxamide N-[2,3-bis(furan-2-yl)quinoxalin-6-yl]azepane-1-carboxamide cid_2214811
Type:
Small organic molecule
Emp. Form.:
C23H22N4O3
Mol. Mass.:
402.4458
SMILES:
O=C(Nc1ccc2nc(-c3ccco3)c(nc2c1)-c1ccco1)N1CCCCCC1
: