Target
M-phase inducer phosphatase 2
Ligand
BDBM38800
Substrate
Meas. Tech.
Cdc25B Catalytic Domain Protein Tyrosine Phosphatase HTS Dose Response Confirmation Assay
IC50
>50000±n/a nM
Citation
 PubChem, PC Cdc25B Catalytic Domain Protein Tyrosine Phosphatase HTS Dose Response Confirmation Assay PubChem Bioassay (2006)[AID] 
Target
Name:
M-phase inducer phosphatase 2
Synonyms:
CDC25B Dual specificity phosphatase (CDC25B) M-phase inducer phosphatase 2 (CDC25B) | MPIP2_HUMAN
Type:
Protein
Mol. Mass.:
64985.27
Organism:
Homo sapiens (Human)
Description:
Residue:
580
  
Inhibitor
Name:
BDBM38800
Synonyms:
5-tert-Butyl-2-piperidin-1-ylmethyl-furan-3-carboxylic acid 5-tert-butyl-2-(piperidin-1-ylmethyl)furan-3-carboxylic acid;hydrochloride MLS000031904 cid_6603658
Type:
Small organic molecule
Emp. Form.:
C15H23NO3
Mol. Mass.:
265.348
SMILES:
CC(C)(C)c1cc(C(O)=O)c(CN2CCCCC2)o1
: