Target
M-phase inducer phosphatase 2
Ligand
BDBM38812
Substrate
Meas. Tech.
Cdc25B Catalytic Domain Protein Tyrosine Phosphatase HTS Dose Response Confirmation Assay
IC50
>50000±n/a nM
Citation
 PubChem, PC Cdc25B Catalytic Domain Protein Tyrosine Phosphatase HTS Dose Response Confirmation Assay PubChem Bioassay (2006)[AID] 
Target
Name:
M-phase inducer phosphatase 2
Synonyms:
CDC25B Dual specificity phosphatase (CDC25B) M-phase inducer phosphatase 2 (CDC25B) | MPIP2_HUMAN
Type:
Protein
Mol. Mass.:
64985.27
Organism:
Homo sapiens (Human)
Description:
Residue:
580
  
Inhibitor
Name:
BDBM38812
Synonyms:
1-(4-chlorophenyl)-3-[4-(2-pyridin-2-ylethyl)piperazin-1-yl]pyrrolidine-2,5-dione 1-(4-chlorophenyl)-3-[4-[2-(2-pyridyl)ethyl]piperazino]pyrrolidine-2,5-quinone SMR000067515 | cid_2999949
Type:
Small organic molecule
Emp. Form.:
C21H23ClN4O2
Mol. Mass.:
398.886
SMILES:
Oc1cc(N2CCN(CCc3ccccn3)CC2)c(O)n1-c1ccc(Cl)cc1
: