Target
M-phase inducer phosphatase 2
Ligand
BDBM38819
Substrate
Meas. Tech.
Cdc25B Catalytic Domain Protein Tyrosine Phosphatase HTS Dose Response Confirmation Assay
IC50
>50000±n/a nM
Citation
 PubChem, PC Cdc25B Catalytic Domain Protein Tyrosine Phosphatase HTS Dose Response Confirmation Assay PubChem Bioassay (2006)[AID] 
Target
Name:
M-phase inducer phosphatase 2
Synonyms:
CDC25B Dual specificity phosphatase (CDC25B) M-phase inducer phosphatase 2 (CDC25B) | MPIP2_HUMAN
Type:
Protein
Mol. Mass.:
64985.27
Organism:
Homo sapiens (Human)
Description:
Residue:
580
  
Inhibitor
Name:
BDBM38819
Synonyms:
MLS000047324 N-[3-(1,4-dioxa-8-azaspiro[4.5]decan-8-yl)-1-(4-methoxyphenyl)-3-oxidanylidene-propyl]-4-fluoranyl-benzenesulfonamide N-[3-(1,4-dioxa-8-azaspiro[4.5]decan-8-yl)-3-keto-1-(4-methoxyphenyl)propyl]-4-fluoro-benzenesulfonamide cid_3238230
Type:
Small organic molecule
Emp. Form.:
C23H27FN2O6S
Mol. Mass.:
478.534
SMILES:
COc1ccc(cc1)C(CC(=O)N1CCC2(CC1)OCCO2)NS(=O)(=O)c1ccc(F)cc1
: