Target
Isoform 2 of Nuclear receptor ROR-alpha (Alpha-2)
Ligand
BDBM36974
Substrate
Meas. Tech.
Counterscreen for inhibitors of the nuclear receptor Steroidogenic Factor 1 (SF-1): A cell-based dose-response assay for inhibition of the RAR-related orphan receptor A (RORA)
IC50
1115±n/a nM
Citation
 PubChem, PC Counterscreen for inhibitors of the nuclear receptor Steroidogenic Factor 1 (SF-1): A cell-based dose-response assay for inhibition of the RAR-related orphan receptor A (RORA) PubChem Bioassay (2007)[AID] 
Target
Name:
Isoform 2 of Nuclear receptor ROR-alpha (Alpha-2)
Synonyms:
NR1F1 Nuclear receptor ROR-alpha (Alpha-2) RORA RZRA
Type:
PROTEIN
Mol. Mass.:
63033.59
Organism:
Homo sapiens (Human)
Description:
EBI_101591
Residue:
556
  
Inhibitor
Name:
BDBM36974
Synonyms:
2-[(3,5-dimethyl-1,2-oxazol-4-yl)methylsulfanyl]-1-[4-(2,3-dimethylphenyl)piperazin-1-yl]ethanone 2-[(3,5-dimethylisoxazol-4-yl)methylthio]-1-[4-(2,3-dimethylphenyl)piperazino]ethanone SMR000064422 cid_2537506
Type:
Small organic molecule
Emp. Form.:
C20H27N3O2S
Mol. Mass.:
373.512
SMILES:
Cc1noc(C)c1CSCC(=O)N1CCN(CC1)c1cccc(C)c1C
: