Target
Steroidogenic factor 1
Ligand
BDBM36838
Substrate
Meas. Tech.
Dose-response cell-based assay for inhibitors of the nuclear receptor Steroidogenic Factor 1 (SF-1)
IC50
4190±n/a nM
Citation
 PubChem, PC Dose-response cell-based assay for inhibitors of the nuclear receptor Steroidogenic Factor 1 (SF-1) PubChem Bioassay (2007)[AID] 
Target
Name:
Steroidogenic factor 1
Synonyms:
AD4BP FTZF1 NR5A1 SF-1 STF-1 Steroid hormone receptor Ad4BP
Type:
Nuclear Hormone Receptor
Mol. Mass.:
51643.43
Organism:
Homo sapiens (Human)
Description:
Residue:
461
  
Inhibitor
Name:
BDBM36838
Synonyms:
1-ethenylsulfonyl-4-(4-ethenylsulfonylphenoxy)benzene MLS000070497 cid_647878
Type:
Small organic molecule
Emp. Form.:
C16H14O5S2
Mol. Mass.:
350.409
SMILES:
C=CS(=O)(=O)c1ccc(Oc2ccc(cc2)S(=O)(=O)C=C)cc1
: