Target
Steroidogenic factor 1
Ligand
BDBM31054
Substrate
Meas. Tech.
Dose-response cell-based assay for inhibitors of the nuclear receptor Steroidogenic Factor 1 (SF-1)
IC50
4687±n/a nM
Citation
 PubChem, PC Dose-response cell-based assay for inhibitors of the nuclear receptor Steroidogenic Factor 1 (SF-1) PubChem Bioassay (2007)[AID] 
Target
Name:
Steroidogenic factor 1
Synonyms:
AD4BP FTZF1 NR5A1 SF-1 STF-1 Steroid hormone receptor Ad4BP
Type:
Nuclear Hormone Receptor
Mol. Mass.:
51643.43
Organism:
Homo sapiens (Human)
Description:
Residue:
461
  
Inhibitor
Name:
BDBM31054
Synonyms:
(2E)-3,3,3-trifluoro-2-(4-keto-6-methyl-[1,3]oxathiolo[4,5-c]pyran-2-ylidene)propionic acid methyl ester MLS000078159 cid_660939 methyl (2E)-3,3,3-tris(fluoranyl)-2-(6-methyl-4-oxidanylidene-[1,3]oxathiolo[4,5-c]pyran-2-ylidene)propanoate
Type:
Small organic molecule
Emp. Form.:
C11H7F3O5S
Mol. Mass.:
308.23
SMILES:
COC(=O)C(=C1\Oc2cc(C)oc(=O)c2S1)\C(F)(F)F
: