Target
Steroidogenic factor 1
Ligand
BDBM38898
Substrate
Meas. Tech.
Dose-response cell-based assay for inhibitors of the nuclear receptor Steroidogenic Factor 1 (SF-1)
IC50
>1222±n/a nM
Citation
 PubChem, PC Dose-response cell-based assay for inhibitors of the nuclear receptor Steroidogenic Factor 1 (SF-1) PubChem Bioassay (2007)[AID] 
Target
Name:
Steroidogenic factor 1
Synonyms:
AD4BP FTZF1 NR5A1 SF-1 STF-1 Steroid hormone receptor Ad4BP
Type:
Nuclear Hormone Receptor
Mol. Mass.:
51643.43
Organism:
Homo sapiens (Human)
Description:
Residue:
461
  
Inhibitor
Name:
BDBM38898
Synonyms:
2-methyl-5-oxidanylidene-4-(3,4,5-trimethoxyphenyl)-1,4-dihydroindeno[1,2-b]pyridine-3-carbonitrile 5-keto-2-methyl-4-(3,4,5-trimethoxyphenyl)-1,4-dihydroindeno[1,2-b]pyridine-3-carbonitrile SMR000057958 | cid_660965
Type:
Small organic molecule
Emp. Form.:
C23H20N2O4
Mol. Mass.:
388.4159
SMILES:
COc1cc(cc(OC)c1OC)C1C(C#N)C(C)=NC2=C1C(=O)c1ccccc21
: