Target
Steroidogenic factor 1
Ligand
BDBM38955
Substrate
Meas. Tech.
Dose-response cell-based assay for inhibitors of the nuclear receptor Steroidogenic Factor 1 (SF-1)
IC50
6521±n/a nM
Citation
 PubChem, PC Dose-response cell-based assay for inhibitors of the nuclear receptor Steroidogenic Factor 1 (SF-1) PubChem Bioassay (2007)[AID] 
Target
Name:
Steroidogenic factor 1
Synonyms:
AD4BP FTZF1 NR5A1 SF-1 STF-1 Steroid hormone receptor Ad4BP
Type:
Nuclear Hormone Receptor
Mol. Mass.:
51643.43
Organism:
Homo sapiens (Human)
Description:
Residue:
461
  
Inhibitor
Name:
BDBM38955
Synonyms:
(4-methoxy-1,3-benzothiazol-2-yl)-[5-(2-methoxyphenyl)-1,3,4-oxadiazol-2-yl]amine MLS000045457 SMR000027217 | cid_3235799
Type:
Small organic molecule
Emp. Form.:
C17H14N4O3S
Mol. Mass.:
354.383
SMILES:
COc1ccccc1-c1nnc(Nc2nc3c(OC)cccc3s2)o1
: