Target
Steroidogenic factor 1
Ligand
BDBM28637
Substrate
Meas. Tech.
Dose-response cell-based assay for inhibitors of the nuclear receptor Steroidogenic Factor 1 (SF-1)
IC50
315±n/a nM
Citation
 PubChem, PC Dose-response cell-based assay for inhibitors of the nuclear receptor Steroidogenic Factor 1 (SF-1) PubChem Bioassay (2007)[AID] 
Target
Name:
Steroidogenic factor 1
Synonyms:
AD4BP FTZF1 NR5A1 SF-1 STF-1 Steroid hormone receptor Ad4BP
Type:
Nuclear Hormone Receptor
Mol. Mass.:
51643.43
Organism:
Homo sapiens (Human)
Description:
Residue:
461
  
Inhibitor
Name:
BDBM28637
Synonyms:
cid_4289057 isoquinolinone scaffold, 1
Type:
Small organic molecule
Emp. Form.:
C24H24N2O7
Mol. Mass.:
452.4566
SMILES:
CCOC(=O)C(C)Oc1cccc2c1ccn(CC(=O)NCc1ccc3OCOc3c1)c2=O
: