Target
Isoform 2 of Nuclear receptor ROR-alpha (Alpha-2)
Ligand
BDBM36845
Substrate
Meas. Tech.
Dose-response cell-based assay for inhibitors of the Retinoic Acid Receptor-related orphan receptor A (RORA)
IC50
1565±n/a nM
Citation
 PubChem, PC Dose-response cell-based assay for inhibitors of the Retinoic Acid Receptor-related orphan receptor A (RORA) PubChem Bioassay (2007)[AID] 
Target
Name:
Isoform 2 of Nuclear receptor ROR-alpha (Alpha-2)
Synonyms:
NR1F1 Nuclear receptor ROR-alpha (Alpha-2) RORA RZRA
Type:
PROTEIN
Mol. Mass.:
63033.59
Organism:
Homo sapiens (Human)
Description:
EBI_101591
Residue:
556
  
Inhibitor
Name:
BDBM36845
Synonyms:
5-tert-Butyl-2-methyl-2H-pyrazole-3-carboxylic acid 4-(2-oxo-pyrrolidin-1-yl)-benzylamide 5-tert-butyl-2-methyl-N-[[4-(2-oxo-1-pyrrolidinyl)phenyl]methyl]-3-pyrazolecarboxamide 5-tert-butyl-N-[4-(2-ketopyrrolidino)benzyl]-2-methyl-pyrazole-3-carboxamide SMR000007305 | cid_648690
Type:
Small organic molecule
Emp. Form.:
C20H26N4O2
Mol. Mass.:
354.446
SMILES:
Cn1nc(cc1C(=O)NCc1ccc(cc1)N1CCCC1=O)C(C)(C)C
: