Target
Steroidogenic factor 1
Ligand
BDBM38935
Substrate
Meas. Tech.
Counterscreen for inhibitors of the Retinoic Acid Receptor-related orphan receptor A (RORA): A cell-based dose-response assay for inhibition of the Steroidogenic Factor 1 (SF-1)
IC50
>5.03±n/a nM
Citation
 PubChem, PC Counterscreen for inhibitors of the Retinoic Acid Receptor-related orphan receptor A (RORA): A cell-based dose-response assay for inhibition of the Steroidogenic Factor 1 (SF-1) PubChem Bioassay (2007)[AID] 
Target
Name:
Steroidogenic factor 1
Synonyms:
AD4BP FTZF1 NR5A1 SF-1 STF-1 Steroid hormone receptor Ad4BP
Type:
Nuclear Hormone Receptor
Mol. Mass.:
51643.43
Organism:
Homo sapiens (Human)
Description:
Residue:
461
  
Inhibitor
Name:
BDBM38935
Synonyms:
2-(1-ethyl-2-methyl-5-benzimidazolyl)-5H-[1,2,4]triazolo[5,1-a]isoindole 2-(1-ethyl-2-methyl-benzimidazol-5-yl)-5H-[1,2,4]triazolo[5,1-a]isoindole MLS000054270 cid_2347892
Type:
Small organic molecule
Emp. Form.:
C19H17N5
Mol. Mass.:
315.3718
SMILES:
CCn1c(C)nc2cc(ccc12)-c1nc2-c3ccccc3Cn2n1
: