Target
Steroidogenic factor 1
Ligand
BDBM38994
Substrate
Meas. Tech.
Counterscreen for inhibitors of the Retinoic Acid Receptor-related orphan receptor A (RORA): A cell-based dose-response assay for inhibition of the Steroidogenic Factor 1 (SF-1)
IC50
656±n/a nM
Citation
 PubChem, PC Counterscreen for inhibitors of the Retinoic Acid Receptor-related orphan receptor A (RORA): A cell-based dose-response assay for inhibition of the Steroidogenic Factor 1 (SF-1) PubChem Bioassay (2007)[AID] 
Target
Name:
Steroidogenic factor 1
Synonyms:
AD4BP FTZF1 NR5A1 SF-1 STF-1 Steroid hormone receptor Ad4BP
Type:
Nuclear Hormone Receptor
Mol. Mass.:
51643.43
Organism:
Homo sapiens (Human)
Description:
Residue:
461
  
Inhibitor
Name:
BDBM38994
Synonyms:
MLS000089367 N-(2-methoxyethyl)-2-[[5-methyl-2-(4-methylsulfanylphenyl)-1,3-oxazol-4-yl]methylsulfanyl]acetamide N-(2-methoxyethyl)-2-[[5-methyl-2-[4-(methylthio)phenyl]-4-oxazolyl]methylthio]acetamide SMR000027742 | cid_3245395
Type:
Small organic molecule
Emp. Form.:
C17H22N2O3S2
Mol. Mass.:
366.498
SMILES:
COCCNC(=O)CSCc1nc(oc1C)-c1ccc(SC)cc1
: