Target
Steroidogenic factor 1
Ligand
BDBM39069
Substrate
Meas. Tech.
Counterscreen for inhibitors of the Retinoic Acid Receptor-related orphan receptor A (RORA): A cell-based dose-response assay for inhibition of the Steroidogenic Factor 1 (SF-1)
IC50
1497±n/a nM
Citation
 PubChem, PC Counterscreen for inhibitors of the Retinoic Acid Receptor-related orphan receptor A (RORA): A cell-based dose-response assay for inhibition of the Steroidogenic Factor 1 (SF-1) PubChem Bioassay (2007)[AID] 
Target
Name:
Steroidogenic factor 1
Synonyms:
AD4BP FTZF1 NR5A1 SF-1 STF-1 Steroid hormone receptor Ad4BP
Type:
Nuclear Hormone Receptor
Mol. Mass.:
51643.43
Organism:
Homo sapiens (Human)
Description:
Residue:
461
  
Inhibitor
Name:
BDBM39069
Synonyms:
(Z)-3-(1,3-benzodioxol-5-ylamino)-1-(2-pyridinyl)-2-propen-1-one (Z)-3-(1,3-benzodioxol-5-ylamino)-1-pyridin-2-yl-prop-2-en-1-one MLS000108346 cid_5310753
Type:
Small organic molecule
Emp. Form.:
C15H12N2O3
Mol. Mass.:
268.2674
SMILES:
O=C(CC=Nc1ccc2OCOc2c1)c1ccccn1
: